BDBM116668 US8637532, 370
SMILES COCCC(Nc1ncnc2c(cccc12)C(N)=O)c1cccc(NC(=O)c2ccccc2)c1
InChI Key InChIKey=YOZQOXRJRWBJBE-UHFFFAOYSA-N
Data  2 IC50
  Tab Delimited (TSV)   2D SDfile   Computed 3D by Vconf -m prep SDfile
Find this compound or compounds like it in BindingDB:
Activity Spreadsheet -- Enzyme Inhibition Constant Data from BindingDB
Found 1 hit for monomerid = 116668
TargetAurora kinase A(Homo sapiens (Human))
Merck Patent
US Patent
LigandPNGBDBM116668(US8637532, 370)
Affinity DataIC50:  0.380nM. Assay description: The Aurora assays described here are performed on two Caliper Life Sciences systems: the LC3000 and the Desktop Profiler. These provide data on enzym...
In DepthDetails US Patent